{"text_format":"1","workbook":"xlsx","n_sheets":9,"sheets":["Instructions and Assumptions","User Inputs","Advanced Inputs","Solar Layout","Solar Summary","HPD Underwriting","Assumptions Calcs & Lookups","25 Year Cash Flow","Change Log"],"not_rendered":{"charts":1,"images":9,"macros":1,"external_links":0,"defined_names":76,"comments":4,"pivot_tables":0},"unopened":[],"bounds":{"document_bytes":16777216,"sheet_cells":100000,"rows_first":2000,"rows_last":500,"rows_between":2000,"halvings":0,"cell_chars":16384,"cell_head_chars":4096},"cells_cut":0,"cells_raw":0,"read":"whole","date_system":"1900"}

{"sheet":"Instructions and Assumptions","index":0,"n_rows":312,"n_cols":5,"rows_kept":312,"cut":false,"hidden":false,"merged":[[306,0,309,6],[311,0,314,6],[285,1,294,6],[38,0,41,6],[298,0,302,6],[259,1,263,6],[65,0,66,6],[68,0,70,6],[265,1,275,6],[255,1,257,6],[230,1,234,6],[242,1,246,6],[248,1,252,6],[186,1,195,6],[197,0,200,6],[211,0,213,6],[219,0,220,6],[222,1,228,6],[161,0,165,6],[170,0,174,6],[175,0,175,6],[178,1,183,6],[149,0,158,6],[167,0,167,6],[215,0,215,6],[137,0,138,6],[140,0,142,6],[144,0,147,6],[134,2,134,6],[129,0,129,1],[130,0,130,1],[131,0,131,1],[132,0,132,1],[133,0,133,1],[134,0,134,1],[129,2,129,6],[130,2,130,6],[131,2,131,6],[132,2,132,6],[133,2,133,6],[98,0,101,6],[108,0,110,6],[113,0,118,6],[121,0,124,6],[126,0,127,6],[119,0,119,6],[120,0,120,6],[111,0,111,6],[112,0,112,6],[104,0,104,6],[107,0,107,6],[125,0,125,6],[102,0,102,6],[103,0,103,6],[4,0,4,6],[5,0,10,6],[12,0,12,6],[14,0,14,6],[16,0,16,6],[18,0,18,6],[22,0,22,6],[37,0,37,6],[44,0,46,6],[97,0,97,6],[20,0,20,6],[27,0,27,6]]}
[]
[null,null,null,null,"Solar Screening Tool"]
[null,null,null,null,"Version 1.5, Updated October 2020"]
[]
["Instructions"]
["This tool can be used to complete a preliminary assessment of solar financial viability for a New York City affordable housing property. This tool was developed by the New York City Department of Housing Preservation and Development (HPD), with support from non-profit Solar One, as part of the agency's efforts to increase the deployment of solar electric systems on affordable housing properties participating in HPD programs. Completing preliminary solar screening is a requirement for all projects covered by the Enterprise Green Communities NYC 2020 Overlay."]
[]
[]
[]
[]
[]
[]
["1. User Inputs: populate all blue fields on the User Inputs tab. Please confirm that all fields are populated accurately, as these inputs impact the solar project financial model. If you do not understand what value to enter into a required field, hover over the field to view a pop-up with explantory text and links."]
[]
["2. Advanced Inputs (Optional): if you have specific information regarding the project, such as a detailed solar design with a specific price, system size and estimated energy production, you can enter this information in the Advanced Inputs tab. All fields on the Advanced Inputs tab are optional, and values provided in the Advanced Inputs tab will override the calculator's default assumptions."]
[]
["3. Solar Layout: include an image of the Sustainable Roofing Zone or the solar panel layout on this tab, and provide a brief (1-2 sentence) description in the blue text area at the bottom of the page. If project has a roof plan showing detailed solar array, please note this on the Layout Page."]
[]
["4. Solar Summary: review this tab, which is read-only, for a summary of financial benefits of solar at the site, calculated based on user inputs. Results include key financial metrics such as the Upfront Cost Estimate, Year One Utility Savings, and Payback Period."]
[]
{"$rows_left_out":293}
{"sheet":"User Inputs","index":1,"n_rows":43,"n_cols":4,"rows_kept":43,"cut":false,"hidden":false,"merged":[[5,0,8,3],[4,0,4,3],[18,0,18,2],[36,0,36,2],[37,0,37,2],[31,0,31,2],[34,0,34,2],[35,0,35,2],[33,0,33,3],[14,0,14,2],[16,0,16,2],[15,0,15,2],[12,0,12,2],[42,0,44,3],[10,0,10,3],[27,0,27,3],[29,0,29,2],[17,0,17,2],[20,0,20,2],[23,0,23,2],[21,0,21,2],[22,0,22,2],[24,0,24,2],[19,0,19,2],[11,0,11,2],[30,0,30,2],[13,0,13,2],[25,0,25,2],[28,0,28,2]]}
[]
[null,null," Solar Screening Tool"]
[null,null,{"$f":"\"        \"&'Instructions and Assumptions'!E3","v":"        Version 1.5, Updated October 2020"}]
[]
["User Inputs"]
["This tool can be used to complete a preliminary assessment of solar financial viability for a New York City affordable housing property based on the inputs below. This tool was developed by the New York City Department of Housing Preservation and Development (HPD), with support from non-profit Solar One, as part of the agency's efforts to increase the deployment of solar electric systems on affordable housing properties participating in HPD programs."]
[]
[]
[]
[]
["Building Characteristics"]
["Site Address",null,null,"123 Main St"]
["HPD ID",null,null,12345]
["Building Type",null,null,"Rental"]
["New Construction vs Renovation",null,null,"New Construction"]
["Prevailing Wages Required",null,null,"No"]
["Project Completion Year",null,null,2021]
["Eligible for Solar Tax Credit",null,null,"Yes"]
["Can Project Benefit from Accelerated Depreciation?",null,null,"Yes"]
["Low Income Housing Tax Credits",null,null,"No"]
{"$rows_left_out":24}
{"sheet":"Advanced Inputs","index":2,"n_rows":37,"n_cols":3,"rows_kept":37,"cut":false,"hidden":true,"merged":[[36,0,38,3],[8,0,8,3],[9,0,9,2],[11,0,11,2],[14,0,14,3],[19,0,19,2],[23,0,23,3],[20,0,20,2],[21,0,21,2],[24,0,24,2],[26,0,26,2],[27,0,27,2],[18,0,18,2],[15,0,15,2],[16,0,16,2],[17,0,17,2],[4,0,4,3],[10,0,10,2],[5,0,6,3],[12,0,12,2],[25,0,25,2]]}
[]
[null,null," Solar Screening Tool"]
[null,null,{"$f":"'User Inputs'!C3","v":"        Version 1.5, Updated October 2020"}]
[]
["ADVANCED INPUTS (OPTIONAL)"]
["Values entered into this form will override any default assumptions or calculated values. All fields on this page are optional."]
[]
[]
["Solar Energy System Characteristics"]
["Solar Energy System Size (kW-DC)"]
["Turnkey Solar Energy System Price ($/Watt-DC)"]
["Year One Production (kWh)"]
["Annual Solar Performance Degradation"]
[]
["Value of Solar ($/kWh)"]
["Con Edison Electricity Tariff (Owner-Paid)"]
["Peak Demand (Prev. 12 Months or Estimated (kW))"]
["Annual Electricity Usage (Actual or Estimated kWh)"]
["CSRP Load Zone"]
["Year One Value of Solar ($/kWh)"]
{"$rows_left_out":18}
{"sheet":"Solar Layout","index":3,"n_rows":43,"n_cols":5,"rows_kept":43,"cut":false,"hidden":false,"merged":[[4,0,4,6],[42,0,43,6],[35,0,41,6],[5,0,8,6]]}
[]
[null,null,null,null,"Solar Screening Tool"]
[null,null,null,null,{"$f":"'User Inputs'!C3","v":"        Version 1.5, Updated October 2020"}]
[]
["Solar PV System Layout or Usable Roof Area"]
["In the space below, include a layout of the building rooftop which includes a preliminary solar PV system design or alternatively identifies areas designated for the installation of solar PV. Please note: projects pursuing Enterprise Green Communities or LEED certification must submit a roof plan to HPD as part of the Solar Feasibility Analysis. This sheet does not need to be utilitized if a roof plan is furnished."]
[]
[]
[]
[]
[]
[]
[]
[]
[]
[]
[]
[]
[]
[]
{"$rows_left_out":24}
{"sheet":"Solar Summary","index":4,"n_rows":41,"n_cols":6,"rows_kept":41,"cut":false,"hidden":false,"merged":[[40,0,40,8],[29,5,29,8],[30,5,35,8],[4,0,7,8],[3,0,3,8],[27,0,27,8],[33,1,33,3],[32,1,32,3],[31,1,31,3],[30,1,30,3],[29,0,29,3],[34,1,34,3]]}
[null,"Solar Screening Tool - Results"]
[null,{"$f":"\"           \"&'Solar Layout'!E3","v":"                   Version 1.5, Updated October 2020"}]
[]
[{"$f":"\"Preliminary Solar Financial Analysis: \"&SiteAddress","v":"Preliminary Solar Financial Analysis: 123 Main St"}]
["Solar electric systems provide electricity bill savings, however they are also eligible for a number of federal, state and local incentives that can significantly improve return on investment. The summary below includes estimated costs, incentives, electricity bill savings, and payback period for a solar energy system on this property."]
[]
[]
[]
[]
["Solar Energy System Size (kW-DC)",null,null,{"$f":"IFERROR(IF(RecommendedPVSystemSize<4,\"System Too Small\",RecommendedPVSystemSize),\"\")","v":42}]
["Year One Solar Production (kWh)",null,null,{"$f":"IFERROR(Y1SolarProduction,\"\")","v":45885}]
["Year One Utility Bill Savings",null,null,{"$f":"IFERROR('25 Year Cash Flow'!F5,\"\")","v":9499.418820112387}]
["Total Cost ($/Watt-DC)",null,null,{"$f":"D14/(PVSystemSize*1000)","v":4.3542857142857141}]
["Total Cost Estimate",null,null,{"$f":"IFERROR(-'Assumptions Calcs & Lookups'!$B$105,\"\")","v":182880}]
["NY-SUN Incentive",null,null,{"$f":"IFERROR('Assumptions Calcs & Lookups'!$B$106,\"\")","v":42000}]
["Upfront Cost Estimate",null,null,{"$f":"IFERROR(D14-D15,\"\")","v":140880}]
["Cost After Incentives and Taxes",null,null,{"$f":"IFERROR(-'Assumptions Calcs & Lookups'!B115,\"\")","v":64736.896774943285}]
["Payback Period",null,null,{"$f":"IF(COUNTIF('25 Year Cash Flow'!Q4:Q29,\"<0\")&\" years\"=\"26 years\", \"N/A\",COUNTIF('25 Year Cash Flow'!Q4:Q29,\"<0\")&\" years\")","v":"7 years"}]
["Internal Rate of Return",null,null,{"$f":"IFERROR(IRR('25 Year Cash Flow'!S4:S29,0.1),\"\")","v":0.12200092823058228}]
["Lifetime Net Savings",null,null,{"$f":"'25 Year Cash Flow'!Q29","v":179505.34732374258}]
{"$rows_left_out":22}
{"sheet":"HPD Underwriting","index":5,"n_rows":46,"n_cols":4,"rows_kept":46,"cut":false,"hidden":true,"merged":[[10,0,10,2],[4,0,4,3],[5,0,6,3],[7,0,7,3],[8,0,8,2],[9,0,9,2],[22,0,22,2],[11,0,11,2],[12,0,12,2],[13,0,13,2],[15,0,15,3],[16,0,16,2],[17,0,17,2],[18,0,18,2],[19,0,19,2],[20,0,20,2],[21,0,21,2],[36,0,36,2],[23,0,23,2],[25,0,25,3],[26,0,26,2],[27,0,27,2],[28,0,28,2],[29,0,29,2],[30,0,30,2],[31,0,31,2],[32,0,32,2],[33,0,33,2],[35,0,35,3],[43,0,43,2],[44,0,44,2],[45,0,45,2],[37,0,37,2],[38,0,38,2],[39,0,39,2],[40,0,40,2],[41,0,41,2],[42,0,42,2]]}
[]
[null,null,"Solar Underwriting Tool"]
[null,null,{"$f":"'Solar Summary'!B2","v":"                   Version 1.5, Updated October 2020"}]
[]
["User Inputs"]
["User to fill in all Highlighted Cells (blue). All other cells will be automatically populated/calculated. This tool can be used to assess preliminary solar financial viability for an NYC affordable housing property from an HPD underwriting perspective."]
[]
["Inputs from Solar Screening Tool or Solar Designer"]
["Site Address",null,null,{"$f":"SiteAddress","v":"123 Main St"}]
["Solar Systen Size (kW-DC) ",null,null,{"$f":"PVSystemSize","v":42}]
["Estimated Owner Electric Cost (Annual)",null,null,{"$f":"AnnualElectricBill","v":20000}]
["Year One Utility Bill Savings (should be lower than Owner's Electric Cost)",null,null,{"$f":"'Solar Summary'!D12","v":9499.418820112387}]
["Upfront Cost Estimate (after NY-SUN) ",null,null,{"$f":"'Solar Summary'!D16","v":140880}]
["Estimated Payback (in years)",null,null,{"$f":"'Solar Summary'!D18","v":"7 years"}]
[]
["Financing & Permanent Loan Assumptions (HPD PM to Populate)"]
["Estimated Project Cost (TDC)"]
["Number of Dwelling Units"]
["Loan Term (years)"]
["Perm. Loan Rate (%)"]
{"$rows_left_out":27}
{"sheet":"Assumptions Calcs & Lookups","index":6,"n_rows":120,"n_cols":12,"rows_kept":120,"cut":false,"hidden":true,"merged":[[2,7,2,11],[2,0,2,2],[16,0,16,1],[18,0,18,1],[28,0,28,1],[9,7,9,11],[10,7,10,10],[11,7,11,10],[12,7,12,10],[13,7,13,10],[14,7,14,10],[102,0,102,1],[47,0,47,1],[55,0,55,1],[30,0,30,1],[67,0,67,1],[78,0,78,1],[84,0,84,2],[96,0,96,1],[41,0,41,1]]}
["Assumptions, Calculations and Lookup Tables"]
[]
["System Price Estimate ($/Watt-DC)",null,null,"<- Update every 12 months",null,null,null,"Incentives by Project Completion Year"]
["Min (kW-DC)","Max (kW-DC)","Price ($/Watt-DC)",null,null,null,null,"Year","ITC","RETC","NY-SUN","NY-SUN Adder"]
[4,9.99,5,null,null,null,null,2020,0.26,0.26,0.4,0.6]
[10,19.989999999999998,4.25,null,null,null,null,2021,0.22,0.22,0.3,0.7]
[20,29.99,3.6,null,null,null,null,2022,0.1,0,0.2,0.8]
[30,44.99,3.3,null,null,null,null,2023,0.1,0,0.15,0.85]
[45,64.989999999999995,3.1]
[65,79.989999999999995,2.95,null,null,null,null,"EPC Price Decrease by Project Completion Year"]
[80,99.99,2.85,null,null,null,null,"Year",null,null,null,"Base Price Percentage"]
[100,149.99,2.7,null,null,null,null,2020,null,null,null,1]
[150,249.99,2.5,null,null,null,null,2021,null,null,null,{"$f":"L12*(1-0.04)","v":0.96}]
[250,499.99,2.2999999999999998,null,null,null,null,2022,null,null,null,{"$f":"L13*(1-0.04)","v":0.92159999999999997}]
[500,749.99,2.2000000000000002,null,null,null,null,2023,null,null,null,{"$f":"L14*(1-0.04)","v":0.88473599999999997}]
[750,null,2.1]
["Base EPC Price for Simulation ($/Watt-DC)",null,{"$f":"LOOKUP(PVSystemSize,Min__kW_DC,Price____Watt_DC)","v":3.3}]
[]
["Pricing Adders",null,"Applies?"]
["Mechanically Attached Adder ($/Watt-DC)",0.25,{"$f":"IF(RecommendedPVSystemSize<15,\"Yes\",IF(BldgHeight>100,\"Yes\",\"No\"))","v":"No"},"<- Systems that are under 15 kW-DC or above 100 ft will be subject to the mechanically attached adder."]
{"$rows_left_out":101}
{"sheet":"25 Year Cash Flow","index":7,"n_rows":29,"n_cols":19,"rows_kept":29,"cut":false,"hidden":true,"merged":[]}
["25 Year Cashflow"]
[]
["Year","Solar Energy Production (kWh)","Value of Solar ($/kWh)","Customer Benefit Contribution (Not CDG)","New Meter Fees (CDG Only)","Net Electricity Bill Savings","Upfront System Cost","Inverter Replacement","Federal Tax Credit","LIHTC","Property Tax Abatement","NYS Tax Credit","NYS Historic Tax Credit","Federal Accelerated Depreciation","State Depreciation","Increased Federal Taxes Due to State Tax Credits","Balance","Balance (No Tax Incentives)","Cash Inflows and Outflows"]
[0,null,null,null,null,null,{"$f":"UpfrontCost","v":-140880},null,null,null,null,null,null,null,null,null,{"$f":"SUM(F4:P4)","v":-140880},{"$f":"Q4","v":-140880},{"$f":"SUM(F4:P4)","v":-140880}]
[1,{"$f":"Y1SolarProduction","v":45885},{"$f":"Y1VoS","v":0.21408780255230223},{"$f":"IF(ElectricTariff=\"EL8\",\"0\",IF(ElectricTariff=\"EL12\",\"0\",IF(AND(ElectricTariff=\"EL9\",PeakDemandkW<25),0,IF(AND(ElectricTariff=\"EL9\",PeakDemandkW>25),(NEMAnnualCBC*0.7),NEMAnnualCBC))))","v":0},{"$f":"IF(ElectricTariff=\"EL2\",0,IF(ElectricTariff=\"EL1\",0,IF(AND(ElectricTariff=\"EL9\",PeakDemandkW>25),0,CDGAnnualMeterFee)))","v":-324},{"$f":"(B5*C5)+SUM(D5:E5)","v":9499.418820112387},null,null,{"$f":"ITC","v":30990.500639999998},{"$f":"TenYearLIHTCValue/10","v":0},{"$f":"NYCPTA/4","v":0},{"$f":"NYSResidentialTaxCredit","v":0},{"$f":"NYSHistoricTaxCredit","v":0},{"$f":"'Assumptions Calcs & Lookups'!B94*'Assumptions Calcs & Lookups'!B87*'Assumptions Calcs & Lookups'!$B$81","v":35151.122833056717},{"$f":"'Assumptions Calcs & Lookups'!$B$95*'Assumptions Calcs & Lookups'!C87*'Assumptions Calcs & Lookups'!$B$82","v":2000.2959504000003},{"$f":"'Assumptions Calcs & Lookups'!B114","v":0},{"$f":"Q4+SUM(F5:P5)","v":-63238.661756430898},{"$f":"R4+F5+H5","v":-131380.58117988761},77641.338243569102]
[2,{"$f":"B5*(1-AnnualPVDegradation)","v":45655.574999999997},{"$f":"C5*(1+VoSEscalator)","v":0.21622868057782524},0,{"$f":"IF(ElectricTariff=\"EL2\",0,IF(ElectricTariff=\"EL1\",0,IF(AND(ElectricTariff=\"EL9\",PeakDemandkW>25),0,CDGAnnualMeterFee)))","v":-324},{"$f":"(B6*C6)+SUM(D6:E6)","v":9548.0447432719429},null,null,null,{"$f":"TenYearLIHTCValue/10","v":0},{"$f":"NYCPTA/4","v":0},null,null,{"$f":"'Assumptions Calcs & Lookups'!$B$94*'Assumptions Calcs & Lookups'!B88*'Assumptions Calcs & Lookups'!$B$81","v":0},{"$f":"'Assumptions Calcs & Lookups'!$B$95*'Assumptions Calcs & Lookups'!C88*'Assumptions Calcs & Lookups'!$B$82","v":3200.4735206399996},null,-50490.143492518953,-121832.53643661567,12748.518263911943]
[3,45427.297124999997,0.2183909673836035,0,-324,9596.9113647511404,null,null,null,0,{"$f":"NYCPTA/4","v":0},null,null,{"$f":"'Assumptions Calcs & Lookups'!$B$94*'Assumptions Calcs & Lookups'!B89*'Assumptions Calcs & Lookups'!$B$81","v":0},{"$f":"'Assumptions Calcs & Lookups'!$B$95*'Assumptions Calcs & Lookups'!C89*'Assumptions Calcs & Lookups'!$B$82","v":1920.2841123840001},null,-38972.948015383809,-112235.62507186453,11517.195477135141]
[4,45200.160639374997,0.22057487705743953,0,-324,9646.0198760066578,null,null,null,0,{"$f":"NYCPTA/4","v":0},null,null,{"$f":"'Assumptions Calcs & Lookups'!$B$94*'Assumptions Calcs & Lookups'!B90*'Assumptions Calcs & Lookups'!$B$81","v":0},{"$f":"'Assumptions Calcs & Lookups'!$B$95*'Assumptions Calcs & Lookups'!C90*'Assumptions Calcs & Lookups'!$B$82","v":1150.1701714799999},null,-28176.757967897152,-102589.60519585788,10796.190047486658]
[5,44974.159836178122,0.22278062582801392,0,-324,9695.3714743928904,null,null,null,0,null,null,null,{"$f":"'Assumptions Calcs & Lookups'!$B$94*'Assumptions Calcs & Lookups'!B91*'Assumptions Calcs & Lookups'!$B$81","v":0},{"$f":"'Assumptions Calcs & Lookups'!$B$95*'Assumptions Calcs & Lookups'!C91*'Assumptions Calcs & Lookups'!$B$82","v":1150.1701714799999},null,-17331.216322024262,-92894.233721464989,10845.541645872891]
[6,44749.28903699723,0.22500843208629406,0,-324,9744.9673631911355,null,null,null,0,null,null,null,{"$f":"'Assumptions Calcs & Lookups'!$B$94*'Assumptions Calcs & Lookups'!B92*'Assumptions Calcs & Lookups'!$B$81","v":0},{"$f":"'Assumptions Calcs & Lookups'!$B$95*'Assumptions Calcs & Lookups'!C92*'Assumptions Calcs & Lookups'!$B$82","v":580.08582561600008},null,-7006.1631332171255,-83149.266358273861,10325.053188807136]
[7,44525.542591812242,0.227258516407157,0,-324,9794.8087516389296,null,null,null,0,null,null,null,null,null,null,2788.6456184218041,-73354.457606634925,9794.8087516389296]
[8,44302.914878853182,0.22953110157122858,0,-324,9844.8968549595429,null,null,null,0,null,null,null,null,null,null,12633.542473381347,-63509.560751675381,9844.8968549595429]
[9,44081.400304458919,0.23182641258694087,0,-324,9895.2328943915945,null,null,null,0,null,null,null,null,null,null,22528.775367772942,-53614.327857283788,9895.2328943915945]
[10,43860.993302936622,0.23414467671281028,0,-324,9945.8180972188329,null,null,null,0,null,null,null,null,null,null,32474.593464991776,-43668.509760064953,9945.8180972188329]
[11,43641.688336421939,0.23648612347993839,0,-324,9996.6536968000655,null,null,null,null,null,null,null,null,null,null,42471.247161791842,-33671.856063264888,9996.6536968000655]
[12,43423.47989473983,0.23885098471473779,0,-324,10047.740932599227,null,null,null,null,null,null,null,null,null,null,52518.988094391068,-23624.115130665661,10047.740932599227]
[13,43206.362495266134,0.24123949456188518,0,-324,10099.081050215595,null,null,null,null,null,null,null,null,null,null,62618.069144606663,-13525.034080450067,10099.081050215595]
[14,42990.330682789805,0.24365188950750402,0,-324,10150.675301414161,null,null,null,null,null,null,null,null,null,null,72768.744446020821,-3374.3587790359052,10150.675301414161]
[15,42775.379029375857,0.24608840840257906,0,-324,10202.524944156163,null,{"$f":"-RecommendedPVSystemSize*'Assumptions Calcs & Lookups'!B83*1000","v":-8400},null,null,null,null,null,null,null,null,74571.269390176982,-1571.8338348797424,1802.5249441561627]
[16,42561.502134228977,0.24854929248660484,0,-324,10254.631242629734,null,null,null,null,null,null,null,null,null,null,84825.900632806719,8682.7974077499912,10254.631242629734]
{"$rows_left_out":10}
{"sheet":"Change Log","index":8,"n_rows":31,"n_cols":2,"rows_kept":31,"cut":false,"hidden":true,"merged":[[26,0,26,1],[20,0,20,1]]}
["CHANGE LOG"]
["Last updated by Noah Ginsburg (noah@solar1.org) on October 20, 2020"]
["2020-10-01"]
["Item","Description"]
["Added HPD ID","Added HPD ID field to User Input and to the bottom of the Solar Summary tab (displayed under contact info)."]
["Corrected formatting issues with HPD Underwriting tab","Formatted all dollar values as $$."]
[]
["2020-06-01"]
["Item","Description"]
["Added TaxCreditMultiplier","To account for the fact that many of the properties are financed with LIHTC, and HPD uses a standard assumption of 99.99% ownership by the tax equity investor. This assumption is applied universally."]
["Added HPD Underwriting tab","Added tab for HPD's underwriting analysis, which provides another view of the incremental cost and/or benefit of a solar project on an affordable housing development's financials."]
["Updated NY-SUN incentive levels","Reduced NYSERDA's base incentive to $0.40/Watt-DC due to the May 2020 drop in the NY-SUN incentive. Modified the affordable housing adder to reflect NYSERDA's modification to the incentive that ensures affordable housing solar projects up to 200 kW-DC receive a $1.00/Watt-DC incentive."]
["Added \"Annual NEM Customer Benefit Contribution \"","Added to Assumptions Calcs & lookups line 65, and Cash Flow column D. Did not include potential escalator that may be determined in the future. Calculation assumes 70% of CBC for large commercial VDER projects (as recommended by the PSC) Calculation extends to 25 years, however PSC only guarantees rate for 20 years."]
["Cleaned up system size formula on Solar Summary","(changed \"B39\" to RecommendedPVSystemSize)"]
["Added Prevailing Wage option","Added Prevailing wage to user inputs which increases the price by 20%"]
[]
["2020-03-20"]
["Item","Description"]
["Added Instructions and Assumptions tab","Added brief instructions for how to use the tool as well as a detailed description of all key assumptions included in the solar screening tool."]
[]
{"$rows_left_out":11}