{"text_format":"1","workbook":"xlsx","n_sheets":8,"sheets":["Instructions & Summary","6.1 Product Category Screening","6.4 Advanced Material Selection","References","6.1 - EXAMPLE","6.4 - EXAMPLE","6.1 - Standards","6.4 - Standards"],"not_rendered":{"charts":0,"images":12,"macros":1,"external_links":0,"defined_names":235,"comments":0,"pivot_tables":0},"unopened":[],"bounds":{"document_bytes":16777216,"sheet_cells":100000,"rows_first":2000,"rows_last":500,"rows_between":2000,"halvings":0,"cell_chars":16384,"cell_head_chars":4096},"cells_cut":0,"cells_raw":0,"read":"whole","date_system":"1900"}

{"sheet":"Instructions & Summary","index":0,"n_rows":41,"n_cols":4,"rows_kept":41,"cut":false,"hidden":false,"merged":[[27,1,27,2],[28,1,28,2],[29,1,29,2],[22,1,22,2],[23,1,23,2],[24,1,24,2],[25,1,25,2],[26,1,26,2],[1,1,1,4],[34,2,34,3],[35,2,35,3],[4,1,4,4],[3,1,3,4],[31,1,31,2],[8,1,8,3],[10,1,10,2],[11,1,11,3],[12,1,14,1],[12,3,17,3],[15,1,17,1],[18,1,18,3],[19,1,19,2],[20,1,20,2],[21,1,21,2]]}
[]
[null,"2026 Green Communities Product Category Screening Template (6.1 & 6.4)"]
[]
[null,"INSTRUCTIONS: "]
[null,"INTENT: This template supports Criteria 6.1 (Product Screening) and 6.4 (Advanced Material Selection). \nUse it to track and document compliant material choices from design through construction.\n\n1. COMPLETE PROJECT INFO\n- White cells indicate fields where project teams enter information; shaded cells are prepopulated.\n- In this tab ('Instructions & Summary' ), enter project name and anticipated submission date.\n- At submission, add the responsible party (typically the architect) name and signature at the bottom of this sheet.\n\n2. COMPLETE REQUIRED TABS\n- Use '6.1 Product Category Screening' to evaluate materials early in design.\n- Use '6.4 Advanced Material Selection' to track materials from design to installation, verifying they meet health and climate requirements.\n- Follow the instructions found at the top of each tab, referring to the 'References' tab when prompted.  \n- Inputs will be automatically tallied and results shown in the Compliance Summary & Point Totals table below. \n\n3. SUBMIT DOCUMENTATION\n- Submit this completed template and supporting documentation (e.g., product cut sheets) as part of the project's Pre-build (6.1) and Post-build (6.4) submissions.\n\nFor more information about the Criteria 6.1 & 6.4 requirements and documentation instructions, review the Green Communities website (https://www.greencommunitiesonline.org/ ), and the 'References' tab at the end of this workbook. "]
[]
[null,"Project Name:  ",null,"Submission Date:  "]
[]
[null,"Compliance Summary & Point Totals"]
[]
[null,"Criterion",null,"Optional Points Achieved"]
[null,"6.1 Product Category Screening   (Optional 4 points)"]
[null,"Embodied Carbon",{"$f":"IF('6.1 Product Category Screening'!C11=\"\",\"Category 1\",'6.1 Product Category Screening'!C11)","v":"Category 1"}]
[null,null,{"$f":"IF('6.1 Product Category Screening'!C12=\"\",\"Category 2\",'6.1 Product Category Screening'!C12)","v":"Category 2"}]
[null,null,{"$f":"IF('6.1 Product Category Screening'!C13=\"\",\"Category 3\",'6.1 Product Category Screening'!C13)","v":"Category 3"}]
{"$rows_left_out":27}
{"sheet":"6.1 Product Category Screening","index":1,"n_rows":22,"n_cols":8,"rows_kept":22,"cut":false,"hidden":false,"merged":[[5,2,5,3],[3,4,3,5],[8,6,8,7],[20,6,20,7],[8,1,9,1],[20,1,21,1],[8,2,8,5],[20,2,20,5],[0,1,0,4],[4,1,4,4],[2,4,2,5],[2,7,2,8],[3,1,3,3],[2,1,2,3]]}
[null,"6.1 Product Category Screening  (Optional 4 points)"]
[]
[null,"INSTRUCTIONS:",null,null,"  LEGEND:"]
[null,"To expand or collapse instructions/legend, use 'Show/Hide Instructions' button in Column I.\n\nINTENT: Use this tool early in design to understand the impact of material choices.\n\n1. IDENTIFY TARGETED PRODUCTS\n- Choose at least 3 product categories each for embodied carbon and material health (Column C).\n\n2. SCREEN USING APPROVED RESOURCES\n- Choose any appropriate screening resource for each category (Column D) using the dropdown.\n- Use the chosen resource to evaluate the potential impacts of different product selections.\n- For embodied carbon, prioritize % reduction in GWP (kgCO2e/m2) - assume a 60 year service life.\n- For material health, prioritize avoidance of substances of concern.\n\n3. SHARE FINDINGS\n- Share findings with team members who hold decision-making power for the products in question. \n- Regardless of outcome, share the reflection of the findings and decisions (Column F) at Prebuild.\n\n4. SUBMIT SCREENING TEMPLATE\n- To earn credit in 6.1, this completed template must be submitted at Prebuild. \n- At least three product categories must be screened for both Embodied Carbon and Material Health. \n- Additional categories may be evaluated, but only the first three count toward 6.1 compliance.\n\n5. OPTIONAL - POST-BUILD REFLECTION\n- Document whether the screening influenced final product selection (Column G/H) at post-build.\n- To expand or collapse post-build columns, use 'Show/Hide Post- Build' button in Column I.\n\nTo ensure proper print settings, select 'Fit All Columns on One Page.'",null,null,"                    \n\n                White cells: Editable; enter product data here\n\n                    \n                Green cells: Pre-Build evaluation (required submission)\n\n\n                Blue cells: Post-Build evaluation (recommended submission)"]
[]
[null,"Project Name:",{"$f":"IF('Instructions & Summary'!C7=\"\",\"\",'Instructions & Summary'!C7)","v":""},null,"Submission Date:   ",{"$f":"IF('Instructions & Summary'!E7=\"\",\"\",'Instructions & Summary'!E7)","v":""}]
[]
[null,"6.1 Embodied Carbon Screening"]
[null,"\n\n\nSpec Reference\n(Optional)","Pre-Build",null,null,null,"Post-Build"]
[null,null,"Product Category\n(Choose one)","Screening Resource\n(Choose one)","Were results shared with appropriate team members? (Yes / No)","Screening Results Reflection \n(Highest impact products, opportunities, challenges)","Did screening (6.1) inform product selection (6.4)? (Yes / No)","Final Reflection\n(Optional)"]
[]
[]
[]
[]
[]
{"$rows_left_out":8}
{"sheet":"6.4 Advanced Material Selection","index":2,"n_rows":1164,"n_cols":17,"rows_kept":1164,"cut":false,"hidden":false,"merged":[[0,1,0,7],[2,8,2,9],[3,8,3,9],[8,0,1058,0],[429,6,429,10],[429,1,429,4],[430,1,431,1],[534,1,534,4],[324,6,324,10],[534,6,534,10],[219,1,219,4],[219,6,219,10],[325,1,326,1],[325,8,325,10],[640,1,641,1],[640,2,641,2],[640,3,641,3],[430,2,431,2],[322,1,322,3],[427,1,427,3],[742,1,742,3],[952,1,952,3],[112,1,112,3],[745,2,746,2],[1163,1,1163,4],[1163,6,1163,10],[115,4,116,4],[115,7,140,11],[9,1,9,4],[9,6,9,10],[849,1,849,4],[849,6,849,10],[850,1,851,1],[744,1,744,4],[745,1,746,1],[220,6,220,7],[1060,2,1061,2],[1060,3,1061,3],[1060,4,1061,4],[850,2,851,2],[850,7,856,11],[220,2,221,2],[220,3,221,3],[325,3,326,3],[640,4,641,4],[430,4,431,4],[1057,1,1057,3],[745,9,745,10],[1060,7,1162,11],[744,6,744,10],[325,4,326,4],[1060,1,1061,1],[745,6,745,8],[955,8,955,9],[535,10,541,11],[535,8,535,9],[955,1,956,1],[954,6,954,10],[954,1,954,4],[639,1,639,4],[535,1,536,1],[850,3,851,3],[850,4,851,4],[325,6,325,7],[430,6,430,7],[745,4,746,4],[745,3,746,3],[639,6,639,10],[745,11,751,11],[533,1,533,4],[638,1,638,4],[848,1,848,4],[953,1,953,4],[10,6,10,8],[640,6,640,8],[640,10,640,11],[325,2,326,2],[955,4,956,4],[955,6,955,7],[955,2,956,2],[955,3,956,3],[10,2,11,2],[10,1,11,1],[114,6,114,10],[220,1,221,1],[535,2,536,2],[430,8,436,11],[535,4,536,4],[430,3,431,3],[217,1,217,3],[847,1,847,3],[1162,1,1162,3],[532,1,532,3],[637,1,637,3],[3,1,3,7],[2,1,2,7],[324,1,324,4],[8,1,8,4],[113,1,113,4],[218,1,218,4],[323,1,323,4],[115,2,116,2],[115,3,116,3],[7,6,7,11],[7,1,7,4],[10,4,11,4],[220,4,221,4],[114,1,114,4],[115,1,116,1],[10,3,11,3],[5,1,5,2],[5,3,5,4],[535,3,536,3],[1059,1,1059,4],[1059,6,1059,10]]}
[null,"6.4 Advanced Material Selection (Mandatory & Optional, 31 points maximum)"]
[]
[null,"INSTRUCTIONS",null,null,null,null,null,null,"LEGEND"]
[null,"To expand or collapse instructions/legend, use 'Show/Hide Instructions' button in Column M.\n\nINTENT: Track materials from design through installation and confirm compliance with health and climate impact requirements. \n\n1. IDENTIFY PRODUCTS AND REQUIREMENTS APPLICABLE TO THE PROJECT\n- Use 'Show/Hide Category' buttons (Column M) to expand or collapse sections, and 'Show/Hide Rows' as needed to enter more products.\n- Use the criteria or 'References' tab to locate specific requirements and approved certifications/standards.\n- Be sure to select the Option pursued (Column L) where applicable to accurately tally points.\n\n2. DOCUMENT ADVANCED MATERIALS SELECTED AND INSTALLED\n- Enter product data in white cells, including name, manufacturer, quantity, and any applicable requirements met (Columns G-L).\n- For each category, track installed quantity by either cost ($) or volume (L).\n- If multiple compliance options exist, confirm the path chosen in Column L.\n- Optional points and mandatory requirements will auto-populate based on data entered.\n- Include all installed products needed to demonstrate compliance (use additional rows as needed).\n- Not all options apply to all products; 'NA' indicates requirement or points are not applicable.\n- To remove data, right-click selected cell(s) and choose 'Clear Contents.'\n\n3. SUBMIT SCREENING TEMPLATE\n- This completed template must be submitted at Post-build to satisfy mandatory and optional criteria. \n\nTo ensure proper print settings, select 'Fit All Columns on One Page.'",null,null,null,null,null,null,"                \n\n              White cells: Editable; enter product data here\n\n\n              Yellow cells: Auto-populated   \n                \n\n              Green cells: Mandatory criteria\n\n\n              Blue cells: Optional criteria"]
[]
[null,"Project Name:",null,{"$f":"IF('Instructions & Summary'!C7=\"\",\"\",'Instructions & Summary'!C7)","v":""},null,null,"Submission Date:",{"$f":"IF('Instructions & Summary'!E7=\"\",\"\",'Instructions & Summary'!E7)","v":""}]
[]
[null," Product Information",null,null,null,null," 6.4 Advanced Material Selection"]
[null," Adhesives and sealants, wet-applied interior",null,null,null,null,"Mandatory requirements met?",{"$f":"IF(OR(H113=\"\",I113=\"\"),\"\",IF(AND(H113=100%,I113>=80%),\"Yes\",\"No\"))","v":""},null,null,"Optional points total:","NA"]
[null," Mandatory - All adhesives and sealants applied inside the air barrier.\n  *See Table 6.4a in 'References' tab for VOC Content thresholds.",null,null,null,null,"Option pursued:",null,null,null,null,"NA"]
[null,null,"Product\nName","Manufacturer \nName","Estimated Product Cost\n(Optional for this category)",null,"Mandatory\nNo additional points"]
[null,null,null,null,null,null,"Estimated Product Volume\n (Liters)","VOC Content \n(g/L)\n100% compliance\nIf not met, type 'NA' in cell.","Approved VOC Emissions Certification or Standard\n≥ 80% compliance\nIf no certification/standard is available, type 'NA' in cell."]
[null,1]
[null,{"$f":"B13+1","v":2}]
[null,{"$f":"B14+1","v":3}]
{"$rows_left_out":1150}
{"sheet":"References","index":3,"n_rows":144,"n_cols":15,"rows_kept":144,"cut":false,"hidden":false,"merged":[[0,1,0,4],[2,1,2,2],[3,1,3,4],[65,1,65,2],[82,1,82,2],[65,3,90,4],[64,1,64,4],[5,1,5,2],[94,1,94,4],[96,1,96,2],[97,1,97,2],[98,1,98,2],[93,1,93,4],[104,1,104,2],[105,1,105,2],[106,1,106,2],[96,3,96,13],[99,1,99,2],[100,1,100,2],[101,1,101,2],[102,1,102,2],[103,1,103,2],[120,1,121,1],[122,1,123,1],[124,1,125,1],[108,3,108,14],[110,1,111,1],[112,1,113,1],[114,1,115,1],[116,1,117,1],[118,1,119,1],[108,1,108,2],[137,1,137,2],[138,1,138,2],[139,1,139,2],[128,1,128,4],[129,1,129,4],[131,1,131,2],[131,3,131,13],[132,1,132,2],[132,11,132,13],[138,11,138,13],[139,11,139,13],[137,6,137,10],[135,11,135,13],[136,11,136,13],[137,11,137,13],[136,3,136,5],[140,1,140,2],[132,6,132,10],[132,3,132,5],[138,6,138,10],[139,6,139,10],[140,6,140,10],[133,1,133,2],[134,1,134,2],[134,3,134,5],[133,3,133,5],[133,6,133,10],[134,6,134,10],[135,1,135,2],[136,1,136,2],[135,6,135,10],[136,6,136,10],[137,3,137,5],[138,3,138,5],[139,3,139,5],[140,3,140,5],[133,11,133,13],[134,11,134,13],[140,11,140,13],[135,3,135,5],[143,1,143,2],[143,3,143,5],[143,6,143,10],[143,11,143,13],[141,1,141,2],[141,3,141,5],[141,6,141,10],[141,11,141,13],[142,1,142,2],[142,3,142,5],[142,6,142,10],[142,11,142,13]]}
[null,"References - Criterion 6.1 Product Category Screening"]
[null,"REQUIREMENTS"]
[null,"During the concept or schematic design phase, project teams must perform a screening exercise — a high-level review of product categories — to understand the embodied carbon and material health implications of their initial product selections. This step is intended to inform project teams’ design decisions, not to finalize product selections.\n\nTo perform the screening, complete all of the following [4 points]:\n\n• Select at least three product categories to screen for embodied carbon and at least three product categories to screen for material health from the product category lists below. Categories should align with materials most likely to be used in the project, prioritized by volume.\n• Select at least one screening resource to evaluate materials for their embodied carbon impacts and one screening resource to evaluate materials for potential health impacts.\n• Use the Green Communities Product Category Screening Template to document the screening results for the project’s initial material health and embodied carbon impacts and, if applicable, identify opportunities to avoid the worst impacts from products by shifting to those with lower embodied carbon and/or with lower risk of potential negative health impacts.\n• Share the screening results with appropriate team members, including designers, general contractor, relevant trades, and sustainability consultants.\n• Ensure team members consider the screening results when selecting products, writing specifications, and procuring products and materials."]
[null,"References - Criterion 6.4 Advanced Material Selection "]
[null,"REQUIREMENTS"]
[null,"Use products that comply with the specifications below. \n\nNotes for all product categories:\n\n• Percentages of installed quantities are by cost or volume within the product category, except where existing materials are preserved or repaired.\n• “CDPH Standard Method” refers to the Standard Method for the Testing and Evaluation of Volatile Organic Chemical Emissions from Indoor Sources using Environmental Chambers, version 1.2, from the California Department of Public Health.\n• PFAS, commonly known as “forever chemicals,” are per- and polyfluoroalkyl substances, which are common coatings on consumer products, including food containers. In construction, they are often used on textiles, window treatments, and exteriors to repel dirt and stains."]
[null,"Adhesives and sealants, wet-applied interior"]
[null,"SCAQMD 1113 Reference"]
[null,"Rule 1168 SCAQMD Volatile Organic Compound (VOC) Limits as of February 5, 2016, Adhesive & Sealants "]
[]
[null,"MANDATORY","OPTIONAL"]
[null,"For adhesives and sealants applied inside the air barrier:\n• VOC content is less than or equal to the thresholds provided by the most recent version of South Coast Air Quality Management District (SCAQMD) 1168 available at the time of product specification.\n• VOC emissions of 80% by volume are verified as meeting the CDPH Standard Method for the school or residential scenario.","None for this category."]
[]
[null,"Cladding, exterior wall"]
[]
{"$rows_left_out":130}
{"sheet":"6.1 - EXAMPLE","index":4,"n_rows":22,"n_cols":8,"rows_kept":22,"cut":false,"hidden":false,"merged":[[2,2,2,3],[5,1,6,1],[5,2,5,5],[5,6,5,7],[17,1,18,1],[17,2,17,5],[17,6,17,7]]}
[null,"EXAMPLE Completed 6.1 Template"]
[]
[null,"Project Name:",{"$f":"IF('Instructions & Summary'!C6=\"\",\"\",'Instructions & Summary'!C6)","v":""},null,"Submission Date:   ",{"$f":"IF('Instructions & Summary'!E6=\"\",\"\",'Instructions & Summary'!E6)","v":""}]
[]
[null,"6.1 Embodied Carbon Screening"]
[null,"\n\n\nSpec Reference\n(Optional)","Pre-Build",null,null,null,"Post-Build"]
[null,null,"Product Category\n(Choose one)","Screening Resource\n(Choose one)","Were results shared with appropriate team members? (Yes / No)","Screening Results Reflection \n(Highest impact products, opportunities, challenges)","Did screening (6.1) inform product selection (6.4)? (Yes / No)","Final Reflection\n(Optional)"]
[null,"09 65 00","Flooring","Embodied Carbon in Construction Calculator (EC3)","Yes","Highest impact products: Luxury vinyl plank\nOpportunities: Sub vinyl for linoleum\nChallenges: $$$","Yes","LVP was replaced with linoleum, leading to 80% reduction in GWP (LVP = 62 CO₂e/m²; Linoleum = 12 CO₂e/m²)"]
[null,"03 05 00\n03 30 00 ","Concrete","Carbon Designer 3D (CD3D) by One Click LCA","Yes","Highest impact products: Current Portland cement mix design\nOpportunities: Subbing current mix design for one that is less than industry average. Portland-limestone mix is possible alternative\nChallenges: Category is one of the top contributors to total GWP on the project.","Yes","Adjusting concrete mix design by replacing clinker with limestone led to 9% reduction in embodied carbon. Carbon intensity score for entire project shifted from a C to B from pre-build to post-build."]
[null,"09 29 00","Gypsum","Common Materials Framework (CMF) climate health impact area","Yes","Current gypsum board can be subbed for lightweight gypsum board.","Yes","Sheetrock brand gypsum was used due to 21% reduction in GWP."]
[]
[]
[]
[]
[]
{"$rows_left_out":8}
{"sheet":"6.4 - EXAMPLE","index":5,"n_rows":1161,"n_cols":17,"rows_kept":1161,"cut":false,"hidden":false,"merged":[[2,1,2,2],[2,3,2,4],[4,1,4,4],[4,6,4,11],[5,0,1055,0],[5,1,5,4],[5,5,1055,5],[6,1,6,4],[6,6,6,10],[7,1,8,1],[7,2,8,2],[7,3,8,3],[112,1,113,1],[112,2,113,2],[112,3,113,3],[112,4,113,4],[112,7,137,11],[214,1,214,3],[7,4,8,4],[7,6,7,8],[109,1,109,3],[110,1,110,4],[111,1,111,4],[111,6,111,10],[215,1,215,4],[216,1,216,4],[216,6,216,10],[217,1,218,1],[217,2,218,2],[217,3,218,3],[217,4,218,4],[217,6,217,7],[319,1,319,3],[320,1,320,4],[321,1,321,4],[321,6,321,10],[322,1,323,1],[322,2,323,2],[322,3,323,3],[322,4,323,4],[322,6,322,7],[322,8,322,10],[424,1,424,3],[426,1,426,4],[426,6,426,10],[427,1,428,1],[427,2,428,2],[427,3,428,3],[427,4,428,4],[427,6,427,7],[427,8,433,11],[529,1,529,3],[530,1,530,4],[531,1,531,4],[531,6,531,10],[532,1,533,1],[532,2,533,2],[532,3,533,3],[532,4,533,4],[532,8,532,9],[532,10,538,11],[634,1,634,3],[635,1,635,4],[636,1,636,4],[636,6,636,10],[637,1,638,1],[637,2,638,2],[637,3,638,3],[637,4,638,4],[637,6,637,8],[637,10,637,11],[845,1,845,4],[846,1,846,4],[846,6,846,10],[847,1,848,1],[847,2,848,2],[847,3,848,3],[847,4,848,4],[847,7,853,11],[739,1,739,3],[741,1,741,4],[741,6,741,10],[742,1,743,1],[742,2,743,2],[742,3,743,3],[742,4,743,4],[742,6,742,8],[742,9,742,10],[742,11,748,11],[844,1,844,3],[1160,1,1160,4],[1160,6,1160,10],[1054,1,1054,3],[1056,1,1056,4],[1056,6,1056,10],[1057,1,1058,1],[1057,2,1058,2],[1057,3,1058,3],[1057,4,1058,4],[1057,7,1159,11],[1159,1,1159,3],[949,1,949,3],[950,1,950,4],[951,1,951,4],[951,6,951,10],[952,1,953,1],[952,2,953,2],[952,3,953,3],[952,4,953,4],[952,6,952,7],[952,8,952,9]]}
[null,"EXAMPLE Completed 6.4 Template"]
[]
[null,"Project Name:",null,{"$f":"IF('Instructions & Summary'!C6=\"\",\"\",'Instructions & Summary'!C6)","v":""},null,null,"Submission Date:",{"$f":"IF('Instructions & Summary'!E6=\"\",\"\",'Instructions & Summary'!E6)","v":""}]
[]
[null," Product Information",null,null,null,null," 6.4 Advanced Material Selection"]
[null," Adhesives and sealants, wet-applied interior",null,null,null,null,"Mandatory requirements met?",{"$f":"IF(OR(H110=\"\",I110=\"\"),\"\",IF(AND(H110=100%,I110>=80%),\"Yes\",\"No\"))","v":"Yes"},null,null,"Optional points total:","NA"]
[null," Mandatory - All adhesives and sealants applied inside the air barrier.\n  *See Table 6.4a in 'References' tab for VOC Content thresholds.",null,null,null,null,"Option pursued:",null,null,null,null,"NA"]
[null,null,"Product\nName","Manufacturer \nName","Estimated Product Cost\n(Optional for this category)",null,"Mandatory\nNo additional points"]
[null,null,null,null,null,null,"Estimated Product Volume\n (Liters)","VOC Content \n(g/L)\n100% compliance\nIf not met, type 'NA' in cell.","Approved VOC Emissions Certification or Standard\n≥ 80% compliance\nIf no certification/standard is available, type 'NA' in cell."]
[null,1,"AC 20+ Silicone","Pecora",6500,null,250,98,"Greenguard Gold"]
[null,{"$f":"B10+1","v":2},"3000 Carpet Tile Adhesive","ShawContract",4000,null,60,8,"Floor Score"]
[null,{"$f":"B11+1","v":3},"Fire Barrier Sealant CP 25WB+","3M",500,null,18,6,"Intertek Clean Air Gold"]
[null,{"$f":"B12+1","v":4},"Fire Barrier 1003SL","3M",500,null,18,53,"Intertek Clean Air Gold",null,null,null,null,null,null,null,"`"]
[null,5,"960 Wallbase Adhesive","Tarkett",2000,null,450,0,"Floor Score",null,null,null,null,null,"`"]
[null,{"$f":"B14+1","v":6},"Mapelastic AquaDefense","Mapei",3000,null,20,100,"SCS Indoor Advanatage Gold"]
{"$rows_left_out":1147}
{"sheet":"6.1 - Standards","index":6,"n_rows":25,"n_cols":5,"rows_kept":25,"cut":false,"hidden":true,"merged":[]}
["Evaluation","Embodied Carbon","Material Health","Embodied Carbon Screening Resources","Material Health Screening Resources"]
["Embodied Carbon","Cladding, exterior wall","Adhesives and sealants, wet-applied interior","Embodied Carbon in Construction Calculator (EC3)","Common Materials Framework (CMF) human health impact area"]
["Material Health","Concrete","Cladding, exterior wall","BEAM Estimator","Habitable’s Informed product guidance and benchmarking tools"]
[null,"Flooring","Flooring","Kaleidoscope: Embodied Carbon Design Tool"]
[null,"Gypsum","Insulation","ZeroGuide"]
[null,"Insulation","Paint, interior","C.Scale"]
[null,"Steel","Wood, composite","Athena Impact"]
[null,"Wood, composite",null,"Tally"]
[null,"Wood, non-composite",null,"Carbon Designer 3D (CD3D) by One Click LCA"]
[null,null,null,"Common Materials Framework (CMF) climate health impact area"]
[]
[]
[]
[]
[]
{"$rows_left_out":11}
{"sheet":"6.4 - Standards","index":7,"n_rows":25,"n_cols":14,"rows_kept":25,"cut":false,"hidden":true,"merged":[]}
["Flooring Option 1","Flooring prohibited"]
["Repaired existing floor","Flexible PVC with phthalates (in vinyl flooring/carpet backings)",null,null,null,null,null,"Expanded cork board",null,null,null,null,null,"Yes: Product is mineral wool batt that is formaldehyde-free."]
["Linoleum","Rubber/rubber–cork flooring from tire-derived crumb rubber",null,null,null,null,null,"Natural wood (including heat treated)",null,null,null,null,null,"Yes: Product is two-part spray polyurethane foam only used to establish sealed air barrier."]
["FSC-certified solid wood flooring/salvaged wood","Carpet with intentionally added PFAS stain-repellant treatments",null,null,null,null,null,"Bamboo",null,null,null,null,null,"Yes: Product is foam insulation that has blowing agents with low GWP (GWP150)."]
["Pre-finished engineered wood/bamboo","Fluid-applied finish floors in regularly occupied area",null,null,null,null,null,"Engineered wood",null,null,null,null,null,"Yes: Product is not one of the above insulation types (compliant)."]
["Pre-finished cork (excluding rubber/cork composite)","Not a prohibited flooring type",null,null,null,null,null,"Thin brick",null,null,null,null,null,"No: Product is one of the above insulation types and does not comply with the minimum standard."]
["No floorcovering (concrete, unfinished CLT structural slab) ",null,null,null,null,null,null,"Natural stone"]
["Ceramic/porcelain tile (no added lead)",null,null,null,null,null,null,"Ceramic"]
["Not a best-in-class flooring type",null,null,null,null,null,null,"Terra-cotta"]
[null,null,null,null,"\n\n",null,null,"Lime plaster"]
[null,null,null,null,null,null,null,"Fiber cement"]
[null,null,null,null,null,null,null,"Preserved or repaired existing cladding, any material"]
[null,null,null,null,null,null,null,"Not a compliant cladding material",null,null,null,null,null,"Wood fiber"]
[null,null,null,null,null,null,null,null,null,null,null,null,null,"Hemp fiber"]
[null,null,null,null,null,null,null,null,null,null,null,null,null,"Cellulose or cotton"]
{"$rows_left_out":10}